Target
Polyunsaturated fatty acid 5-lipoxygenase
Ligand
BDBM50029577
Substrate
Meas. Tech.
ChEMBL_4073 (CHEMBL620875)
IC50
22.0±n/a nM
Citation
 Hutchinson, JHRiendeau, DBrideau, CChan, CFalgueyret, JPGuay, JJones, TRLépine, CMacdonald, DMcFarlane, CS Thiopyrano[2,3,4-cd]indoles as 5-lipoxygenase inhibitors: synthesis, biological profile, and resolution of 2-[2-[1-(4-chlorobenzyl)-4-methyl-6-[(5-phenylpyridin-2-yl)methoxy]-4,5 -dihydro-1H-thiopyrano[2,3,4-cd]indol-2-yl]ethoxy]butanoic acid. J Med Chem 37:1153-64 (1994)  
Target
Name:
Polyunsaturated fatty acid 5-lipoxygenase
Synonyms:
5-LO 5-Lipoxygenase (5-LO) 5-Lipoygenase ALOX5 LOG5 | LOX5_HUMAN
Type:
Enzyme
Mol. Mass.:
77972.74
Organism:
Homo sapiens (Human)
Description:
Recombinant protein was purified from E. coli lysate. After ammonium sulfate precipitation and subsequent steps, the supernatant (S100) was used for 5-LO activity assay.
Residue:
674
  
Inhibitor
Name:
BDBM50029577
Synonyms:
2-{2-[1-(4-Chloro-benzyl)-4-methyl-6-(5-phenyl-pyridin-2-ylmethoxy)-4,5-dihydro-1H-thiopyrano[2,3,4-cd]indol-2-yl]-ethoxy}-butyric acid | CHEMBL275634
Type:
Small organic molecule
Emp. Form.:
C36H35ClN2O4S
Mol. Mass.:
627.192
SMILES:
CCC(OCCc1c2SC(C)Cc3c(OCc4ccc(cn4)-c4ccccc4)ccc(n1Cc1ccc(Cl)cc1)c23)C(O)=O
: