Target
Dihydrofolate reductase
Ligand
BDBM50041175
Substrate
Meas. Tech.
ChEMBL_54908 (CHEMBL664717)
IC50
>26000±n/a nM
Citation
 Gangjee, ADevraj, RMcGuire, JJKisliuk, RLQueener, SFBarrows, LR Classical and nonclassical furo[2,3-d]pyrimidines as novel antifolates: synthesis and biological activities. J Med Chem 37:1169-76 (1994)  
Target
Name:
Dihydrofolate reductase
Synonyms:
DYR_LACCA folA
Type:
PROTEIN
Mol. Mass.:
18437.08
Organism:
Lactobacillus casei
Description:
ChEMBL_1357878
Residue:
163
  
Inhibitor
Name:
BDBM50041175
Synonyms:
5-[(3,4,5-Trimethoxy-phenylamino)-methyl]-furo[2,3-d]pyrimidine-2,4-diamine | CHEMBL16950
Type:
Small organic molecule
Emp. Form.:
C16H19N5O4
Mol. Mass.:
345.3532
SMILES:
COc1cc(NCc2coc3nc(N)nc(N)c23)cc(OC)c1OC
: