Target
Bifunctional purine biosynthesis protein ATIC
Ligand
BDBM50041179
Substrate
Meas. Tech.
ChEMBL_28411 (CHEMBL642455)
IC50
>30000±n/a nM
Citation
 Gangjee, ADevraj, RMcGuire, JJKisliuk, RLQueener, SFBarrows, LR Classical and nonclassical furo[2,3-d]pyrimidines as novel antifolates: synthesis and biological activities. J Med Chem 37:1169-76 (1994)  
Target
Name:
Bifunctional purine biosynthesis protein ATIC
Synonyms:
5-aminoimidazole-4-carboxamide ribonucleotide formyltransferase AICAR Tfase ATIC Bifunctional purine biosynthesis protein PURH IMP cyclohydrolase Inosinicase PURH Thymidylate synthase/GAR transformylase/AICAR transformylase
Type:
Protein
Mol. Mass.:
64616.62
Organism:
Homo sapiens (Human)
Description:
P31939
Residue:
592
  
Inhibitor
Name:
BDBM50041179
Synonyms:
2-{4-[(2,4-Diamino-furo[2,3-d]pyrimidin-5-ylmethyl)-amino]-benzoylamino}-pentanedioic acid | CHEMBL17383
Type:
Small organic molecule
Emp. Form.:
C19H20N6O6
Mol. Mass.:
428.3987
SMILES:
Nc1nc(N)c2c(CNc3ccc(cc3)C(=O)NC(CCC(O)=O)C(O)=O)coc2n1
: