Target
Dihydrofolate reductase
Ligand
BDBM50041180
Substrate
Meas. Tech.
ChEMBL_55130 (CHEMBL665456)
IC50
>21000±n/a nM
Citation
 Gangjee, ADevraj, RMcGuire, JJKisliuk, RLQueener, SFBarrows, LR Classical and nonclassical furo[2,3-d]pyrimidines as novel antifolates: synthesis and biological activities. J Med Chem 37:1169-76 (1994)  
Target
Name:
Dihydrofolate reductase
Synonyms:
DYR_RAT Dihydrofolate reductase (DHFR) Tetrahydrofolate dehydrogenase
Type:
Enzyme
Mol. Mass.:
21638.84
Organism:
Rattus norvegicus (rat)
Description:
Residue:
187
  
Inhibitor
Name:
BDBM50041180
Synonyms:
5-[(2,5-Dimethoxy-phenylamino)-methyl]-furo[2,3-d]pyrimidine-2,4-diamine | CHEMBL17044
Type:
Small organic molecule
Emp. Form.:
C15H17N5O3
Mol. Mass.:
315.3272
SMILES:
COc1ccc(OC)c(NCc2coc3nc(N)nc(N)c23)c1
: