Target
Dihydrofolate reductase
Ligand
BDBM50041180
Substrate
Meas. Tech.
ChEMBL_54908 (CHEMBL664717)
IC50
>31000±n/a nM
Citation
 Gangjee, ADevraj, RMcGuire, JJKisliuk, RLQueener, SFBarrows, LR Classical and nonclassical furo[2,3-d]pyrimidines as novel antifolates: synthesis and biological activities. J Med Chem 37:1169-76 (1994)  
Target
Name:
Dihydrofolate reductase
Synonyms:
DYR_LACCA folA
Type:
PROTEIN
Mol. Mass.:
18437.08
Organism:
Lactobacillus casei
Description:
ChEMBL_1357878
Residue:
163
  
Inhibitor
Name:
BDBM50041180
Synonyms:
5-[(2,5-Dimethoxy-phenylamino)-methyl]-furo[2,3-d]pyrimidine-2,4-diamine | CHEMBL17044
Type:
Small organic molecule
Emp. Form.:
C15H17N5O3
Mol. Mass.:
315.3272
SMILES:
COc1ccc(OC)c(NCc2coc3nc(N)nc(N)c23)c1
: