Target
Cysteinyl leukotriene receptor 1
Ligand
BDBM50041360
Substrate
Meas. Tech.
ChEMBL_152998 (CHEMBL759482)
Ki
2.2±n/a nM
Citation
 Jacobs, RTBernstein, PRCronk, LAVacek, EPNewcomb, LFAharony, DBuckner, CKKusner, EJ Synthesis, structure-activity relationships, and pharmacological evaluation of a series of fluorinated 3-benzyl-5-indolecarboxamides: identification of 4-[[5-[((2R)-2-methyl-4,4,4-trifluorobutyl)carbamoyl]-1-methyl indol- 3-yl]methyl]-3-methoxy-N-[(2-methylphenyl)sulfonyl]benzamide, a potent, orall J Med Chem 37:1282-97 (1994)  
Target
Name:
Cysteinyl leukotriene receptor 1
Synonyms:
CLTR1_CAVPO | CYSLTR1
Type:
Enzyme Catalytic Domain
Mol. Mass.:
39007.58
Organism:
GUINEA PIG
Description:
Leukotriene D4 0 GUINEA PIG::Q2NNR5
Residue:
340
  
Inhibitor
Name:
BDBM50041360
Synonyms:
3-[2-Methoxy-4-(toluene-2-sulfonylaminocarbonyl)-benzyl]-1-methyl-1H-indole-5-carboxylic acid (4,4,4-trifluoro-2,2-dimethyl-butyl)-amide | CHEMBL26384
Type:
Small organic molecule
Emp. Form.:
C32H34F3N3O5S
Mol. Mass.:
629.69
SMILES:
COc1cc(ccc1Cc1cn(C)c2ccc(cc12)C(=O)NCC(C)(C)CC(F)(F)F)C(=O)NS(=O)(=O)c1ccccc1C
: