Target
Sigma non-opioid intracellular receptor 1
Ligand
BDBM50494706
Substrate
Meas. Tech.
ChEMBL_1280662 (CHEMBL3097103)
Ki
0.150000±n/a nM
Citation
 Motel, WCHealy, JRViard, EPouw, BMartin, KMatsumoto, RRCoop, A Chlorophenylpiperazine analogues as high affinity dopamine transporter ligands. Bioorg Med Chem Lett 23:6920-6922 (2013)  
Target
Name:
Sigma non-opioid intracellular receptor 1
Synonyms:
Opioid receptor SGMR1_RAT Sigma non-opioid intracellular receptor 1 Sigma-1 | Sigmar1
Type:
Enzyme Catalytic Domain
Mol. Mass.:
25266.54
Organism:
RAT
Description:
Q9R0C9
Residue:
223
  
Inhibitor
Name:
BDBM50494706
Synonyms:
CHEMBL3093268
Type:
Small organic molecule
Emp. Form.:
C18H21ClN2
Mol. Mass.:
300.826
SMILES:
Clc1ccccc1N1CCN(CCc2ccccc2)CC1
: