Target
Polyphenol oxidase 2
Ligand
BDBM50100861
Substrate
Meas. Tech.
ChEMBL_1277453 (CHEMBL3095776)
IC50
>100000±n/a nM
Citation
 Kashima, YMiyazawa, M Synthesis, antioxidant capacity, and structure-activity relationships of tri-O-methylnorbergenin analogues on tyrosinase inhibition. Bioorg Med Chem Lett 23:6580-4 (2013)  
Target
Name:
Polyphenol oxidase 2
Synonyms:
Monophenol monooxygenase PPO2 Tyrosinase
Type:
Protein
Mol. Mass.:
63923.66
Organism:
Agaricus bisporus (Common mushroom)
Description:
O42713
Residue:
556
  
Inhibitor
Name:
BDBM50100861
Synonyms:
3,4-Dihydroxybenzoate, VIII 4,5-Dihydroxybenzoic acid CHEMBL37537 Protocatechuic acid (M1) cid_72
Type:
Small organic molecule
Emp. Form.:
C7H6O4
Mol. Mass.:
154.1201
SMILES:
OC(=O)c1ccc(O)c(O)c1
: