Target
Type-1 angiotensin II receptor B
Ligand
BDBM50041676
Substrate
Meas. Tech.
ChEMBL_36636 (CHEMBL652347)
IC50
5.3±n/a nM
Citation
 Mederski, WWDorsch, DBokel, HHBeier, NLues, ISchelling, P Non-peptide angiotensin II receptor antagonists: synthesis and biological activity of a series of novel 4,5-dihydro-4-oxo-3H-imidazo[4,5-c]pyridine derivatives. J Med Chem 37:1632-45 (1994)  
Target
Name:
Type-1 angiotensin II receptor B
Synonyms:
AGTRB_RAT Agtr1 Angiotensin II AT1B Angiotensin II type 1b (AT-1b) receptor Type-1B angiotensin II receptor
Type:
Enzyme Catalytic Domain
Mol. Mass.:
40929.44
Organism:
RAT
Description:
Angiotensin II AT1B 0 RAT::P29089
Residue:
359
  
Inhibitor
Name:
BDBM50041676
Synonyms:
2-{2-Butyl-4-oxo-3-[2'-(1H-tetrazol-5-yl)-biphenyl-4-ylmethyl]-3,4-dihydro-imidazo[4,5-c]pyridin-5-ylmethyl}-benzoic acid ethyl ester | CHEMBL45195
Type:
Small organic molecule
Emp. Form.:
C34H33N7O3
Mol. Mass.:
587.6709
SMILES:
CCCCc1nc2ccn(Cc3ccccc3C(=O)OCC)c(=O)c2n1Cc1ccc(cc1)-c1ccccc1-c1nnn[nH]1
: