Target
Type-2 angiotensin II receptor
Ligand
BDBM50041700
Substrate
Meas. Tech.
ChEMBL_36769 (CHEMBL650292)
Ki
300±n/a nM
Citation
 Mederski, WWDorsch, DBokel, HHBeier, NLues, ISchelling, P Non-peptide angiotensin II receptor antagonists: synthesis and biological activity of a series of novel 4,5-dihydro-4-oxo-3H-imidazo[4,5-c]pyridine derivatives. J Med Chem 37:1632-45 (1994)  
Target
Name:
Type-2 angiotensin II receptor
Synonyms:
AGTR2_RAT Agtr2 Angiotensin II receptor Type-2 angiotensin II receptor
Type:
Enzyme Catalytic Domain
Mol. Mass.:
41346.62
Organism:
RAT
Description:
Angiotensin II AT2 0 0::P35351
Residue:
363
  
Inhibitor
Name:
BDBM50041700
Synonyms:
2-{2-Butyl-4-oxo-3-[2'-(1H-tetrazol-5-yl)-biphenyl-4-ylmethyl]-3,4-dihydro-imidazo[4,5-c]pyridin-5-yl}-N,N-diphenyl-acetamide | CHEMBL42101
Type:
Small organic molecule
Emp. Form.:
C38H34N8O2
Mol. Mass.:
634.729
SMILES:
CCCCc1nc2ccn(CC(=O)N(c3ccccc3)c3ccccc3)c(=O)c2n1Cc1ccc(cc1)-c1ccccc1-c1nnn[nH]1
: