Target
Type-1 angiotensin II receptor
Ligand
BDBM50041969
Substrate
Meas. Tech.
ChEBML_36929
IC50
0.100000±n/a nM
Citation
 de Laszlo, SEQuagliato, CSGreenlee, WJPatchett, AAChang, RSLotti, VJChen, TBScheck, SAFaust, KAKivlighn, SS A potent, orally active, balanced affinity angiotensin II AT1 antagonist and AT2 binding inhibitor. J Med Chem 36:3207-10 (1993)  
Target
Name:
Type-1 angiotensin II receptor
Synonyms:
AGTR1 ANGIOTENSIN AT1 Angiotensin II type 1a (AT-1a) receptor
Type:
Enzyme Catalytic Domain
Mol. Mass.:
41009.15
Organism:
RABBIT
Description:
ANGIOTENSIN AT1 AGTR1 RABBIT::P34976
Residue:
359
  
Inhibitor
Name:
BDBM50041969
Synonyms:
3-{2-Butyl-4-oxo-3-[2'-(1H-tetrazol-5-yl)-biphenyl-4-ylmethyl]-3,4-dihydro-quinazolin-6-yl}-1-isopropyl-1-methyl-urea CHEMBL24322 | L-159093
Type:
Small organic molecule
Emp. Form.:
C31H34N8O2
Mol. Mass.:
550.6541
SMILES:
CCCCc1nc2ccc(NC(=O)N(C)C(C)C)cc2c(=O)n1Cc1ccc(cc1)-c1ccccc1-c1nnn[nH]1
: