Target
Type-1 angiotensin II receptor
Ligand
BDBM50041963
Substrate
Meas. Tech.
ChEBML_36929
IC50
2.5±n/a nM
Citation
 de Laszlo, SEQuagliato, CSGreenlee, WJPatchett, AAChang, RSLotti, VJChen, TBScheck, SAFaust, KAKivlighn, SS A potent, orally active, balanced affinity angiotensin II AT1 antagonist and AT2 binding inhibitor. J Med Chem 36:3207-10 (1993)  
Target
Name:
Type-1 angiotensin II receptor
Synonyms:
AGTR1 ANGIOTENSIN AT1 Angiotensin II type 1a (AT-1a) receptor
Type:
Enzyme Catalytic Domain
Mol. Mass.:
41009.15
Organism:
RABBIT
Description:
ANGIOTENSIN AT1 AGTR1 RABBIT::P34976
Residue:
359
  
Inhibitor
Name:
BDBM50041963
Synonyms:
CHEMBL24861 {2-Butyl-4-oxo-3-[2'-(2H-tetrazol-5-yl)-biphenyl-4-ylmethyl]-3,4-dihydro-quinazolin-6-yl}-methyl-carbamic acid isobutyl ester
Type:
Small organic molecule
Emp. Form.:
C32H35N7O3
Mol. Mass.:
565.6654
SMILES:
CCCCc1nc2ccc(cc2c(=O)n1Cc1ccc(cc1)-c1ccccc1-c1nnn[nH]1)N(C)C(=O)OCC(C)C
: