Target
Bifunctional dihydrofolate reductase-thymidylate synthase
Ligand
BDBM50042354
Substrate
Meas. Tech.
ChEBML_53313
IC50
13±n/a nM
Citation
 Gangjee, AShi, JQueener, SFBarrows, LRKisliuk, RL Synthesis of 5-methyl-5-deaza nonclassical antifolates as inhibitors of dihydrofolate reductases and as potential antipneumocystis, antitoxoplasma, and antitumor agents. J Med Chem 36:3437-43 (1993)  
Target
Name:
Bifunctional dihydrofolate reductase-thymidylate synthase
Synonyms:
DHFR-TS Dihydrofolate reductase Dihydrofolate reductase; T. gondii vs rat
Type:
Enzyme
Mol. Mass.:
68757.49
Organism:
Toxoplasma gondii
Description:
Q07422
Residue:
610
  
Inhibitor
Name:
BDBM50042354
Synonyms:
CHEMBL115788 | N-(2,4-Diamino-5-methyl-pyrido[2,3-d]pyrimidin-6-ylmethyl)-N-(3,4,5-trimethoxy-phenyl)-formamide
Type:
Small organic molecule
Emp. Form.:
C19H22N6O4
Mol. Mass.:
398.4158
SMILES:
COc1cc(cc(OC)c1OC)N(Cc1cnc2nc(N)nc(N)c2c1C)C=O
: