Target
Calpain-2 catalytic subunit
Ligand
BDBM50042402
Substrate
Meas. Tech.
ChEBML_43855
pH
8±n/a
Ki
470±n/a nM
Comments
extracted
Citation
 Li, ZPatil, GSGolubski, ZEHori, HTehrani, KForeman, JEEveleth, DDBartus, RTPowers, JC Peptide alpha-keto ester, alpha-keto amide, and alpha-keto acid inhibitors of calpains and other cysteine proteases. J Med Chem 36:3472-80 (1993)  
Target
Name:
Calpain-2 catalytic subunit
Synonyms:
CAN2_HUMAN CANPL2 Calcium-activated neutral proteinase 2 Calpain M-type Calpain-2 (m-Calpain) Calpain-2 large subunit M-calpain calpain
Type:
Protein
Mol. Mass.:
79965.18
Organism:
Homo sapiens (Human)
Description:
Residue:
700
  
Inhibitor
Name:
BDBM50042402
Synonyms:
3-(2-Benzyloxycarbonylamino-4-methyl-pentanoylamino)-2-oxo-pentanoic acid benzyl ester | CHEMBL115630
Type:
Small organic molecule
Emp. Form.:
C26H32N2O6
Mol. Mass.:
468.5421
SMILES:
CCC(NC(=O)C(CC(C)C)NC(=O)OCc1ccccc1)C(=O)C(=O)OCc1ccccc1
: