Target
Calpain small subunit 1/1 catalytic subunit
Ligand
BDBM50042427
Substrate
Meas. Tech.
ChEMBL_43671 (CHEMBL656204)
Ki
200±n/a nM
Citation
 Li, ZPatil, GSGolubski, ZEHori, HTehrani, KForeman, JEEveleth, DDBartus, RTPowers, JC Peptide alpha-keto ester, alpha-keto amide, and alpha-keto acid inhibitors of calpains and other cysteine proteases. J Med Chem 36:3472-80 (1993)  
Target
Name:
Calpain small subunit 1/1 catalytic subunit
Synonyms:
Calpain 1 | Calpain 1/small subunit 1
Type:
Mol. Mass.:
Description:
ASSAY_ID of EBI is 43671
Components:
This complex has 2 components.
Component 1
Name:
Calpain small subunit 1
Synonyms:
CAPN4 CAPNS1 Calpain 1
Type:
PROTEIN
Mol. Mass.:
28309.36
Organism:
Homo sapiens (Human)
Description:
EBI_12682
Residue:
268
  
Component 2
Name:
Calpain-1 catalytic subunit
Synonyms:
CAN1_HUMAN CAPN1 Calpain-1 (u-Calpain) Calpain1
Type:
Protein
Mol. Mass.:
81880.51
Organism:
Homo sapiens (Human)
Description:
Residue:
714
  
Inhibitor
Name:
BDBM50042427
Synonyms:
CHEMBL118025 | [1-(1-Benzylaminooxalyl-propylcarbamoyl)-3-methyl-butyl]-carbamic acid benzyl ester
Type:
Small organic molecule
Emp. Form.:
C26H33N3O5
Mol. Mass.:
467.5573
SMILES:
CCC(NC(=O)C(CC(C)C)NC(=O)OCc1ccccc1)C(=O)C(=O)NCc1ccccc1
: