Target
Cathepsin B
Ligand
BDBM50042424
Substrate
Meas. Tech.
ChEBML_47386
pH
5.2±n/a
Ki
20000±n/a nM
Comments
extracted
Citation
 Li, ZPatil, GSGolubski, ZEHori, HTehrani, KForeman, JEEveleth, DDBartus, RTPowers, JC Peptide alpha-keto ester, alpha-keto amide, and alpha-keto acid inhibitors of calpains and other cysteine proteases. J Med Chem 36:3472-80 (1993)  
Target
Name:
Cathepsin B
Synonyms:
BCSB CTSB Cathepsin B1
Type:
Enzyme
Mol. Mass.:
36657.87
Organism:
Bos taurus (bovine)
Description:
Bovine spleen CB was purchased from Sigma Co. (USA).
Residue:
335
  
Inhibitor
Name:
BDBM50042424
Synonyms:
3-(2-Benzyloxycarbonylamino-4-methyl-pentanoylamino)-2-oxo-heptanoic acid ethyl ester | CHEMBL116358
Type:
Small organic molecule
Emp. Form.:
C23H34N2O6
Mol. Mass.:
434.5259
SMILES:
CCCCC(NC(=O)C(CC(C)C)NC(=O)OCc1ccccc1)C(=O)C(=O)OCC
: