Target
Type-1 angiotensin II receptor
Ligand
BDBM50042535
Substrate
Meas. Tech.
ChEBML_36933
IC50
2.3±n/a nM
Citation
 Ashton, WTHutchins, SMGreenlee, WJDoss, GAChang, RSLotti, VJFaust, KAChen, TBZingaro, GJKivlighn, SD Nonpeptide angiotensin II antagonists derived from 1H-pyrazole-5-carboxylates and 4-aryl-1H-imidazole-5-carboxylates. J Med Chem 36:3595-605 (1994)  
Target
Name:
Type-1 angiotensin II receptor
Synonyms:
AGTR1 ANGIOTENSIN AT1 Angiotensin II type 1a (AT-1a) receptor
Type:
Enzyme Catalytic Domain
Mol. Mass.:
41009.15
Organism:
RABBIT
Description:
ANGIOTENSIN AT1 AGTR1 RABBIT::P34976
Residue:
359
  
Inhibitor
Name:
BDBM50042535
Synonyms:
5-Butyl-2-(3-chloro-phenyl)-4-[2'-(1H-tetrazol-5-yl)-biphenyl-4-ylmethyl]-2H-pyrazole-3-carboxylic acid | CHEMBL330571
Type:
Small organic molecule
Emp. Form.:
C28H25ClN6O2
Mol. Mass.:
512.99
SMILES:
CCCCc1nn(c(C(O)=O)c1Cc1ccc(cc1)-c1ccccc1-c1nnn[nH]1)-c1cccc(Cl)c1
: