Target
3-hydroxy-3-methylglutaryl-coenzyme A reductase
Ligand
BDBM50006412
Substrate
Meas. Tech.
ChEBML_80662
IC50
5±n/a nM
Citation
 Procopiou, PADraper, CDHutson, JLInglis, GGRoss, BCWatson, NS Inhibitors of cholesterol biosynthesis. 2. 3,5-Dihydroxy-7-(N-pyrrolyl)-6-heptenoates, a novel series of HMG-CoA reductase inhibitors. J Med Chem 36:3658-62 (1994)  
Target
Name:
3-hydroxy-3-methylglutaryl-coenzyme A reductase
Synonyms:
HMDH_RAT Hmgcr
Type:
Enzyme
Mol. Mass.:
96689.85
Organism:
Rattus norvegicus (rat)
Description:
Isolated rat liver microsomes were used as enzyme source.
Residue:
887
  
Inhibitor
Name:
BDBM50006412
Synonyms:
(3R,5R)-3,5-dihydroxy-7-((1S,2S,6S,8S,8aR)-6-hydroxy-2-methyl-8-((S)-2-methylbutanoyloxy)-1,2,6,7,8,8a-hexahydronaphthalen-1-yl)heptanoate sodium CHEMBL690 Eptastatin Sodium Pravachol SQ-31000 Sodium; 3,5-dihydroxy-7-[6-hydroxy-2-methyl-8-(2-methyl-butyryloxy)-1,2,6,7,8,8a-hexahydro-naphthalen-1-yl]-heptanoate
Type:
Small organic molecule
Emp. Form.:
C23H35O7
Mol. Mass.:
423.5203
SMILES:
CC[C@H](C)C(=O)O[C@H]1C[C@@H](O)C=C2C=C[C@H](C)[C@H](CCC(O)C[C@@H](O)CC([O-])=O)[C@@H]12
: