Target
Leukotriene B4 receptor 1
Ligand
BDBM50231569
Substrate
Meas. Tech.
ChEMBL_218511 (CHEMBL824134)
Ki
>10000±n/a nM
Citation
 van Wijngaarden, IHamminga, Dvan Hes, RStandaar, PJTipker, JTulp, MTMol, FOlivier, Bde Jonge, A Development of high-affinity 5-HT3 receptor antagonists. Structure-affinity relationships of novel 1,7-annelated indole derivatives. J Med Chem 36:3693-9 (1994)  
Target
Name:
Leukotriene B4 receptor 1
Synonyms:
Blt LTB4-R 1 Leukotriene B4 receptor 1 | Ltb4r
Type:
Enzyme Catalytic Domain
Mol. Mass.:
37956.07
Organism:
RAT
Description:
Leukotriene B4 0 RAT::Q9R0Q2
Residue:
351
  
Inhibitor
Name:
BDBM50231569
Synonyms:
Cilansetron | KC-9946
Type:
Small organic molecule
Emp. Form.:
C20H21N3O
Mol. Mass.:
319.4002
SMILES:
Cc1nccn1C[C@H]1CCc2c(C1=O)c1cccc3CCCn2c13
: