Target
D(1A) dopamine receptor
Ligand
BDBM50231569
Substrate
Meas. Tech.
ChEMBL_58796 (CHEMBL667038)
Ki
>10000±n/a nM
Citation
 van Wijngaarden, IHamminga, Dvan Hes, RStandaar, PJTipker, JTulp, MTMol, FOlivier, Bde Jonge, A Development of high-affinity 5-HT3 receptor antagonists. Structure-affinity relationships of novel 1,7-annelated indole derivatives. J Med Chem 36:3693-9 (1994)  
Target
Name:
D(1A) dopamine receptor
Synonyms:
DOPAMINE D1 Dopamine D1 high Dopamine receptor Dopamine1-like Drd1a
Type:
Enzyme Catalytic Domain
Mol. Mass.:
49429.75
Organism:
RAT
Description:
P18901
Residue:
446
  
Inhibitor
Name:
BDBM50231569
Synonyms:
Cilansetron | KC-9946
Type:
Small organic molecule
Emp. Form.:
C20H21N3O
Mol. Mass.:
319.4002
SMILES:
Cc1nccn1C[C@H]1CCc2c(C1=O)c1cccc3CCCn2c13
: