Target
5-hydroxytryptamine receptor 3A/3B
Ligand
BDBM50042714
Substrate
Meas. Tech.
ChEMBL_3003 (CHEMBL619793)
Ki
0.230000±n/a nM
Citation
 van Wijngaarden, IHamminga, Dvan Hes, RStandaar, PJTipker, JTulp, MTMol, FOlivier, Bde Jonge, A Development of high-affinity 5-HT3 receptor antagonists. Structure-affinity relationships of novel 1,7-annelated indole derivatives. J Med Chem 36:3693-9 (1994)  
Target
Name:
5-hydroxytryptamine receptor 3A/3B
Synonyms:
Serotonin 3 (5-HT3) receptor | Serotonin 3a (5-HT3a)/3b (5-HT3b) receptor
Type:
Mol. Mass.:
Description:
ASSAY_ID of EBI is 2974
Components:
This complex has 2 components.
Component 1
Name:
5-hydroxytryptamine receptor 3B
Synonyms:
5HT3B_RAT Serotonin (5-HT) receptor
Type:
PROTEIN
Mol. Mass.:
50328.78
Organism:
Rattus norvegicus
Description:
EBI_11885
Residue:
437
  
Component 2
Name:
5-hydroxytryptamine receptor 3A
Synonyms:
5-HT3 5HT3A_RAT Htr3 Serotonin (5-HT) receptor | Zacopride site-R
Type:
Enzyme Catalytic Domain
Mol. Mass.:
55428.70
Organism:
RAT
Description:
5-HT3 HTR3A RAT::P35563
Residue:
483
  
Inhibitor
Name:
BDBM50042714
Synonyms:
9-(2-Methyl-imidazol-1-ylmethyl)-4,5,8,9-tetrahydro-7H-pyrrolo[3,2,1-jk]carbazol-10-one | CHEMBL333466
Type:
Small organic molecule
Emp. Form.:
C19H19N3O
Mol. Mass.:
305.3737
SMILES:
Cc1nccn1CC1CCc2c(C1=O)c1cccc3CCn2c13
: