Target
Delta-type opioid receptor
Ligand
BDBM50001460
Substrate
Meas. Tech.
ChEBML_147043
Ki
90±n/a nM
Citation
 Salvadori, SBryant, SDBianchi, CBalboni, GScaranari, VAttila, MLazarus, LH Phe3-substituted analogues of deltorphin C. Spatial conformation and topography of the aromatic ring in peptide recognition by delta opioid receptors. J Med Chem 36:3748-56 (1994)  
Target
Name:
Delta-type opioid receptor
Synonyms:
Cytochrome P450 3A4 Delta opioid receptor Delta-type opioid receptor (DOR) OPRD_RAT Opioid receptor Opioid receptors; mu & delta Ror-a | Voltage-gated potassium channel
Type:
G Protein-Coupled Receptor (GPCR)
Mol. Mass.:
40465.04
Organism:
Rattus norvegicus (rat)
Description:
Competition binding assays were using CHO-K1 cell membranes expressing the opioid receptor.
Residue:
372
  
Inhibitor
Name:
BDBM50001460
Synonyms:
3-[(2-{2-[2-Amino-3-(4-hydroxy-phenyl)-propionylamino]-propionyl}-1,2,3,4-tetrahydro-isoquinoline-3-carbonyl)-amino]-N-{1-[1-(carbamoylmethyl-carbamoyl)-2-methyl-propylcarbamoyl]-2-methyl-propyl}-succinamic acid H-Tyr-D-Ala-Tic-Asp-Val-Val-Gly-NH2
Type:
Small organic molecule
Emp. Form.:
C38H52N8O10
Mol. Mass.:
780.8671
SMILES:
CC(C)[C@H](NC(=O)[C@@H](NC(=O)[C@H](CC(O)=O)NC(=O)[C@@H]1Cc2ccccc2CN1C(=O)[C@@H](C)NC(=O)[C@@H](N)Cc1ccc(O)cc1)C(C)C)C(=O)NCC(N)=O
: