Target
Neprilysin
Ligand
BDBM21641
Substrate
Meas. Tech.
ChEBML_144611
IC50
6±n/a nM
Citation
 Stanton, JLSperbeck, DMTrapani, AJCote, DSakane, YBerry, CJGhai, RD Heterocyclic lactam derivatives as dual angiotensin converting enzyme and neutral endopeptidase 24.11 inhibitors. J Med Chem 36:3829-33 (1994)  
Target
Name:
Neprilysin
Synonyms:
Mme Neprilysin Neutral endopeptidase 24.11
Type:
Protein
Mol. Mass.:
85789.59
Organism:
Rattus norvegicus (Rat)
Description:
P07861
Residue:
750
  
Inhibitor
Name:
BDBM21641
Synonyms:
2-(2-benzyl-3-sulfanylpropanamido)acetic acid Thiorphan
Type:
Small organic molecule
Emp. Form.:
C12H15NO3S
Mol. Mass.:
253.317
SMILES:
OC(=O)CNC(=O)C(CS)Cc1ccccc1
: