Target
Neprilysin
Ligand
BDBM50042837
Substrate
Meas. Tech.
ChEMBL_144611 (CHEMBL750539)
IC50
1300±n/a nM
Citation
 Stanton, JLSperbeck, DMTrapani, AJCote, DSakane, YBerry, CJGhai, RD Heterocyclic lactam derivatives as dual angiotensin converting enzyme and neutral endopeptidase 24.11 inhibitors. J Med Chem 36:3829-33 (1994)  
Target
Name:
Neprilysin
Synonyms:
Mme Neprilysin Neutral endopeptidase 24.11
Type:
Protein
Mol. Mass.:
85789.59
Organism:
Rattus norvegicus (Rat)
Description:
P07861
Residue:
750
  
Inhibitor
Name:
BDBM50042837
Synonyms:
6-Mercaptomethyl-5-oxo-1-thia-4-aza-cyclotetradecane-3-carboxylic acid | CHEMBL421664
Type:
Small organic molecule
Emp. Form.:
C14H25NO3S2
Mol. Mass.:
319.483
SMILES:
OC(=O)[C@@H]1CSCCCCCCCCC(CS)C(=O)N1
: