Target
Polyunsaturated fatty acid 5-lipoxygenase
Ligand
BDBM50042947
Substrate
Meas. Tech.
ChEBML_3921
IC50
8900±n/a nM
Citation
 Sogawa, SNihro, YUeda, HIzumi, AMiki, TMatsumoto, HSatoh, T 3,4-Dihydroxychalcones as potent 5-lipoxygenase and cyclooxygenase inhibitors. J Med Chem 36:3904-9 (1994)  
Target
Name:
Polyunsaturated fatty acid 5-lipoxygenase
Synonyms:
Alox5 LOX5_RAT
Type:
PROTEIN
Mol. Mass.:
78082.31
Organism:
Rattus norvegicus
Description:
ChEMBL_1432947
Residue:
673
  
Inhibitor
Name:
BDBM50042947
Synonyms:
1-(4-Chloro-phenyl)-3-(4-hydroxy-3-methoxy-phenyl)-propenone 4'-chloro-3-methoxy-4-hydroxychalcone Chalcone 4
Type:
Small organic molecule
Emp. Form.:
C16H13ClO3
Mol. Mass.:
288.726
SMILES:
COc1cc(\C=C\C(=O)c2ccc(Cl)cc2)ccc1O
: