Target
Polyunsaturated fatty acid 5-lipoxygenase
Ligand
BDBM50042974
Substrate
Meas. Tech.
ChEBML_3921
IC50
22±n/a nM
Citation
 Sogawa, SNihro, YUeda, HIzumi, AMiki, TMatsumoto, HSatoh, T 3,4-Dihydroxychalcones as potent 5-lipoxygenase and cyclooxygenase inhibitors. J Med Chem 36:3904-9 (1994)  
Target
Name:
Polyunsaturated fatty acid 5-lipoxygenase
Synonyms:
Alox5 LOX5_RAT
Type:
PROTEIN
Mol. Mass.:
78082.31
Organism:
Rattus norvegicus
Description:
ChEMBL_1432947
Residue:
673
  
Inhibitor
Name:
BDBM50042974
Synonyms:
3-(3,4-Dihydroxy-phenyl)-1-(2-thiophen-2-yl-phenyl)-propenone | CHEMBL129644
Type:
Small organic molecule
Emp. Form.:
C19H14O3S
Mol. Mass.:
322.378
SMILES:
Oc1ccc(\C=C\C(=O)c2ccccc2-c2cccs2)cc1O
: