Target
Polyunsaturated fatty acid 5-lipoxygenase
Ligand
BDBM50042983
Substrate
Meas. Tech.
ChEBML_3921
IC50
17000±n/a nM
Citation
 Sogawa, SNihro, YUeda, HIzumi, AMiki, TMatsumoto, HSatoh, T 3,4-Dihydroxychalcones as potent 5-lipoxygenase and cyclooxygenase inhibitors. J Med Chem 36:3904-9 (1994)  
Target
Name:
Polyunsaturated fatty acid 5-lipoxygenase
Synonyms:
Alox5 LOX5_RAT
Type:
PROTEIN
Mol. Mass.:
78082.31
Organism:
Rattus norvegicus
Description:
ChEMBL_1432947
Residue:
673
  
Inhibitor
Name:
BDBM50042983
Synonyms:
3-(4-Hydroxy-3-methoxy-phenyl)-1-(2-hydroxy-phenyl)-propenone | CHEMBL130640
Type:
Small organic molecule
Emp. Form.:
C16H14O4
Mol. Mass.:
270.28
SMILES:
COc1cc(\C=C\C(=O)c2ccccc2O)ccc1O
: