Target
Polyunsaturated fatty acid 5-lipoxygenase
Ligand
BDBM50042972
Substrate
Meas. Tech.
ChEBML_3921
IC50
15±n/a nM
Citation
 Sogawa, SNihro, YUeda, HIzumi, AMiki, TMatsumoto, HSatoh, T 3,4-Dihydroxychalcones as potent 5-lipoxygenase and cyclooxygenase inhibitors. J Med Chem 36:3904-9 (1994)  
Target
Name:
Polyunsaturated fatty acid 5-lipoxygenase
Synonyms:
Alox5 LOX5_RAT
Type:
PROTEIN
Mol. Mass.:
78082.31
Organism:
Rattus norvegicus
Description:
ChEMBL_1432947
Residue:
673
  
Inhibitor
Name:
BDBM50042972
Synonyms:
3-(3,4-Dihydroxy-phenyl)-1-(2-hydroxy-4-methoxy-phenyl)-propenone CHEMBL340244
Type:
Small organic molecule
Emp. Form.:
C16H14O5
Mol. Mass.:
286.2794
SMILES:
COc1ccc(C(=O)\C=C\c2ccc(O)c(O)c2)c(O)c1
: