Target
Polyunsaturated fatty acid 5-lipoxygenase
Ligand
BDBM50042960
Substrate
Meas. Tech.
ChEBML_3921
IC50
9.8±n/a nM
Citation
 Sogawa, SNihro, YUeda, HIzumi, AMiki, TMatsumoto, HSatoh, T 3,4-Dihydroxychalcones as potent 5-lipoxygenase and cyclooxygenase inhibitors. J Med Chem 36:3904-9 (1994)  
Target
Name:
Polyunsaturated fatty acid 5-lipoxygenase
Synonyms:
Alox5 LOX5_RAT
Type:
PROTEIN
Mol. Mass.:
78082.31
Organism:
Rattus norvegicus
Description:
ChEMBL_1432947
Residue:
673
  
Inhibitor
Name:
BDBM50042960
Synonyms:
3-(3,4-Dihydroxy-phenyl)-1-(3-dimethylamino-phenyl)-propenone | CHEMBL339788
Type:
Small organic molecule
Emp. Form.:
C17H17NO3
Mol. Mass.:
283.3218
SMILES:
CN(C)c1cccc(c1)C(=O)\C=C\c1ccc(O)c(O)c1
: