Target
Type-1 angiotensin II receptor B
Ligand
BDBM50043262
Substrate
Meas. Tech.
ChEMBL_34819 (CHEMBL648963)
IC50
1700±n/a nM
Citation
 Ries, UJMihm, GNarr, BHasselbach, KMWittneben, HEntzeroth, Mvan Meel, JCWienen, WHauel, NH 6-Substituted benzimidazoles as new nonpeptide angiotensin II receptor antagonists: synthesis, biological activity, and structure-activity relationships. J Med Chem 36:4040-51 (1994)  
Target
Name:
Type-1 angiotensin II receptor B
Synonyms:
AGTRB_RAT Agtr1 Angiotensin II AT1B Angiotensin II type 1b (AT-1b) receptor Type-1B angiotensin II receptor
Type:
Enzyme Catalytic Domain
Mol. Mass.:
40929.44
Organism:
RAT
Description:
Angiotensin II AT1B 0 RAT::P29089
Residue:
359
  
Inhibitor
Name:
BDBM50043262
Synonyms:
4'-(4-Amino-2-butyl-benzoimidazol-1-ylmethyl)-biphenyl-2-carboxylic acid | CHEMBL339360
Type:
Small organic molecule
Emp. Form.:
C25H25N3O2
Mol. Mass.:
399.4849
SMILES:
CCCCc1nc2c(N)cccc2n1Cc1ccc(cc1)-c1ccccc1C(O)=O
: