Target
Type-1 angiotensin II receptor B
Ligand
BDBM50043278
Substrate
Meas. Tech.
ChEMBL_34819 (CHEMBL648963)
IC50
1200±n/a nM
Citation
 Ries, UJMihm, GNarr, BHasselbach, KMWittneben, HEntzeroth, Mvan Meel, JCWienen, WHauel, NH 6-Substituted benzimidazoles as new nonpeptide angiotensin II receptor antagonists: synthesis, biological activity, and structure-activity relationships. J Med Chem 36:4040-51 (1994)  
Target
Name:
Type-1 angiotensin II receptor B
Synonyms:
AGTRB_RAT Agtr1 Angiotensin II AT1B Angiotensin II type 1b (AT-1b) receptor Type-1B angiotensin II receptor
Type:
Enzyme Catalytic Domain
Mol. Mass.:
40929.44
Organism:
RAT
Description:
Angiotensin II AT1B 0 RAT::P29089
Residue:
359
  
Inhibitor
Name:
BDBM50043278
Synonyms:
4'-(2-Butyl-4-methyl-benzoimidazol-1-ylmethyl)-biphenyl-2-carboxylic acid | CHEMBL130539
Type:
Small organic molecule
Emp. Form.:
C26H26N2O2
Mol. Mass.:
398.4968
SMILES:
CCCCc1nc2c(C)cccc2n1Cc1ccc(cc1)-c1ccccc1C(O)=O
: