Target
Type-1 angiotensin II receptor
Ligand
BDBM50043426
Substrate
Meas. Tech.
ChEMBL_36939 (CHEMBL650274)
IC50
780±n/a nM
Citation
 Dhanoa, DSBagley, SWChang, RSLotti, VJChen, TBKivlighn, SDZingaro, GJSiegl, PKPatchett, AAGreenlee, WJ Non-peptide angiotensin II receptor antagonists. 1. Design, synthesis, and biological activity of N-substituted indoles and dihydroindoles. J Med Chem 36:4230-8 (1994)  
Target
Name:
Type-1 angiotensin II receptor
Synonyms:
AGTR1 ANGIOTENSIN AT1 Angiotensin II type 1a (AT-1a) receptor
Type:
Enzyme Catalytic Domain
Mol. Mass.:
41009.15
Organism:
RABBIT
Description:
ANGIOTENSIN AT1 AGTR1 RABBIT::P34976
Residue:
359
  
Inhibitor
Name:
BDBM50043426
Synonyms:
CHEMBL133654 | [5-(2-Ethyl-5,7-dimethyl-3H-imidazo[4,5-b]pyridin-4-ylmethyl)-2,3-dihydro-indol-1-yl]-[2-(1H-tetrazol-5-yl)-phenyl]-methanone
Type:
Small organic molecule
Emp. Form.:
C27H26N8O
Mol. Mass.:
478.5483
SMILES:
CCc1nc2c(C)cc(C)nc2n1Cc1ccc2N(CCc2c1)C(=O)c1ccccc1-c1nnn[nH]1
: