Target
Type-1 angiotensin II receptor
Ligand
BDBM50043439
Substrate
Meas. Tech.
ChEMBL_36939 (CHEMBL650274)
IC50
92±n/a nM
Citation
 Dhanoa, DSBagley, SWChang, RSLotti, VJChen, TBKivlighn, SDZingaro, GJSiegl, PKPatchett, AAGreenlee, WJ Non-peptide angiotensin II receptor antagonists. 1. Design, synthesis, and biological activity of N-substituted indoles and dihydroindoles. J Med Chem 36:4230-8 (1994)  
Target
Name:
Type-1 angiotensin II receptor
Synonyms:
AGTR1 ANGIOTENSIN AT1 Angiotensin II type 1a (AT-1a) receptor
Type:
Enzyme Catalytic Domain
Mol. Mass.:
41009.15
Organism:
RABBIT
Description:
ANGIOTENSIN AT1 AGTR1 RABBIT::P34976
Residue:
359
  
Inhibitor
Name:
BDBM50043439
Synonyms:
CHEMBL134901 | {2-[5-(2-Ethyl-5,7-dimethyl-3H-imidazo[4,5-b]pyridin-4-ylmethyl)-indole-1-carbonyl]-phenyl}-carbamic acid
Type:
Small organic molecule
Emp. Form.:
C27H25N5O3
Mol. Mass.:
467.5191
SMILES:
CCc1nc2c(C)cc(C)nc2n1Cc1ccc2n(ccc2c1)C(=O)c1ccccc1NC(O)=O
: