Target
Type-2 angiotensin II receptor
Ligand
BDBM50043431
Substrate
Meas. Tech.
ChEMBL_35406 (CHEMBL647505)
IC50
16000±n/a nM
Citation
 Dhanoa, DSBagley, SWChang, RSLotti, VJChen, TBKivlighn, SDZingaro, GJSiegl, PKPatchett, AAGreenlee, WJ Non-peptide angiotensin II receptor antagonists. 1. Design, synthesis, and biological activity of N-substituted indoles and dihydroindoles. J Med Chem 36:4230-8 (1994)  
Target
Name:
Type-2 angiotensin II receptor
Synonyms:
AGTR2_RAT Agtr2 Angiotensin II receptor Type-2 angiotensin II receptor
Type:
Enzyme Catalytic Domain
Mol. Mass.:
41346.62
Organism:
RAT
Description:
Angiotensin II AT2 0 0::P35351
Residue:
363
  
Inhibitor
Name:
BDBM50043431
Synonyms:
3-[5-(2-Ethyl-5,7-dimethyl-3H-imidazo[4,5-b]pyridin-4-ylmethyl)-2,3-dihydro-indol-1-yl]-3-phenyl-propionic acid methyl ester | CHEMBL135521
Type:
Small organic molecule
Emp. Form.:
C28H30N4O2
Mol. Mass.:
454.5634
SMILES:
CCc1nc2c(C)cc(C)nc2n1Cc1ccc2N(CCc2c1)C(C(=O)OC)c1ccccc1
: