Target
Stromelysin-1
Ligand
BDBM50043578
Substrate
Meas. Tech.
ChEMBL_205627 (CHEMBL812386)
Ki
34000±n/a nM
Citation
 Chapman, KTKopka, IEDurette, PLEsser, CKLanza, TJIzquierdo-Martin, MNiedzwiecki, LChang, BHarrison, RKKuo, DW Inhibition of matrix metalloproteinases by N-carboxyalkyl peptides. J Med Chem 36:4293-301 (1994)  
Target
Name:
Stromelysin-1
Synonyms:
MMP-3 MMP3_HUMAN Matrix metalloproteinase 3 Matrix metalloproteinase-3 (MMP-3) SL-1 Stromelysin 1 | Transin-1
Type:
Enzyme
Mol. Mass.:
53973.13
Organism:
Homo sapiens (Human)
Description:
P08254
Residue:
477
  
Inhibitor
Name:
BDBM50043578
Synonyms:
1N-phenyl-2-[1-amino-(1R)-ethylcarboxamido(phenyl)methylcarboxamido]-4-methyl-(2S)-pentanamide | CHEMBL2370820
Type:
Small organic molecule
Emp. Form.:
C23H30N4O3
Mol. Mass.:
410.5093
SMILES:
CC(C)C[C@H](NC(=O)[C@@H](NC(=O)[C@@H](C)N)c1ccccc1)C(=O)Nc1ccccc1
: