Target
Polyunsaturated fatty acid 5-lipoxygenase
Ligand
BDBM50043667
Substrate
Meas. Tech.
ChEMBL_3821 (CHEMBL618007)
IC50
510±n/a nM
Citation
 Lambert-van der Brempt, CBruneau, PLamorlette, MAFoster, SJ Conformational analysis of 5-lipoxygenase inhibitors: role of the substituents in chiral recognition and on the active conformations of the (methoxyalkyl)thiazole and methoxytetrahydropyran series. J Med Chem 37:113-24 (1994)  
Target
Name:
Polyunsaturated fatty acid 5-lipoxygenase
Synonyms:
5-LO 5-Lipoxygenase (5-LO) 5-Lipoygenase ALOX5 LOG5 | LOX5_HUMAN
Type:
Enzyme
Mol. Mass.:
77972.74
Organism:
Homo sapiens (Human)
Description:
Recombinant protein was purified from E. coli lysate. After ammonium sulfate precipitation and subsequent steps, the supernatant (S100) was used for 5-LO activity assay.
Residue:
674
  
Inhibitor
Name:
BDBM50043667
Synonyms:
2-{(R)-1-Methoxy-1-[2-methyl-3-(naphthalen-2-ylmethoxy)-phenyl]-ethyl}-thiazole | CHEMBL434392
Type:
Small organic molecule
Emp. Form.:
C24H23NO2S
Mol. Mass.:
389.51
SMILES:
CO[C@@](C)(c1nccs1)c1cccc(OCc2ccc3ccccc3c2)c1C
: