Target
Adenosine receptor A2a
Ligand
BDBM50496131
Substrate
Meas. Tech.
ChEMBL_1292708 (CHEMBL3123575)
Ki
0.200000±n/a nM
Citation
 Yadav, RBansal, RKachler, SKlotz, KN Novel 8-(p-substituted-phenyl/benzyl)xanthines with selectivity for the A2A adenosine receptor possess bronchospasmolytic activity. Eur J Med Chem 75:327-35 (2014)  
Target
Name:
Adenosine receptor A2a
Synonyms:
A2A adenosine receptor (hA2A) ADENOSINE A2 ADORA2 Adenosine A2A receptor (A2AAR)
Type:
G Protein-Coupled Receptor (GPCR)
Mol. Mass.:
44716.46
Organism:
Homo sapiens (Human)
Description:
P29274
Residue:
412
  
Inhibitor
Name:
BDBM50496131
Synonyms:
CHEMBL3121724
Type:
Small organic molecule
Emp. Form.:
C19H23N5O3
Mol. Mass.:
369.4176
SMILES:
Cn1c2nc([nH]c2c(=O)n(C)c1=O)-c1ccc(OCCN2CCCC2)cc1
: