Target
Mu-type opioid receptor
Ligand
BDBM50001468
Substrate
Meas. Tech.
ChEMBL_136094 (CHEMBL745616)
IC50
2890±n/a nM
Citation
 Misicka, ALipkowski, AWHorvath, RDavis, PYamamura, HIPorreca, FHruby, VJ Design of cyclic deltorphins and dermenkephalins with a disulfide bridge leads to analogues with high selectivity for delta-opioid receptors. J Med Chem 37:141-5 (1994)  
Target
Name:
Mu-type opioid receptor
Synonyms:
M-OR-1 Mu opioid receptor OPIATE Mu OPRM_CAVPO
Type:
Enzyme Catalytic Domain
Mol. Mass.:
11165.58
Organism:
GUINEA PIG
Description:
P97266
Residue:
98
  
Inhibitor
Name:
BDBM50001468
Synonyms:
(S)-3-((S)-2-{(R)-2-[(S)-2-Amino-3-(4-hydroxy-phenyl)-propionylamino]-propionylamino}-3-phenyl-propionylamino)-N-{(S)-1-[(S)-1-(carbamoylmethyl-carbamoyl)-2-methyl-propylcarbamoyl]-2-methyl-propyl}-succinamic acid CHEMBL317956 deltorphin C
Type:
Small organic molecule
Emp. Form.:
C37H52N8O10
Mol. Mass.:
768.8564
SMILES:
CC(C)[C@H](NC(=O)[C@@H](NC(=O)[C@H](CC(O)=O)NC(=O)[C@H](Cc1ccccc1)NC(=O)[C@@H](C)NC(=O)[C@@H](N)Cc1ccc(O)cc1)C(C)C)C(=O)NCC(N)=O
: