Target
Delta-type opioid receptor
Ligand
BDBM50043719
Substrate
Meas. Tech.
ChEMBL_145886 (CHEMBL754252)
IC50
3.40±n/a nM
Citation
 Misicka, ALipkowski, AWHorvath, RDavis, PYamamura, HIPorreca, FHruby, VJ Design of cyclic deltorphins and dermenkephalins with a disulfide bridge leads to analogues with high selectivity for delta-opioid receptors. J Med Chem 37:141-5 (1994)  
Target
Name:
Delta-type opioid receptor
Synonyms:
DOR-1 MSL-2 OPRD_MOUSE Oprd1
Type:
Enzyme Catalytic Domain
Mol. Mass.:
40577.25
Organism:
MOUSE
Description:
P32300
Residue:
372
  
Inhibitor
Name:
BDBM50043719
Synonyms:
3-(2-{[(4R,10R,13S)-13-[(S)-2-Amino-3-(4-hydroxy-phenyl)-propionylamino]-10-benzyl-7-(3H-imidazol-4-ylmethyl)-3,3,14,14-tetramethyl-6,9,12-trioxo-1,2-dithia-5,8,11-triaza-cyclotetradecane-4-carbonyl]-amino}-hexanoylamino)-succinamic acid | CHEMBL2372214
Type:
Small organic molecule
Emp. Form.:
C44H60N10O10S2
Mol. Mass.:
953.138
SMILES:
CCCC[C@H](NC(=O)[C@H]1NC(=O)[C@H](Cc2c[nH]cn2)NC(=O)[C@H](Cc2ccccc2)NC(=O)[C@H](NC(=O)[C@@H](N)Cc2ccc(O)cc2)C(C)(C)SSC1(C)C)C(=O)N[C@@H](CC(O)=O)C(N)=O
: