Target
Interstitial collagenase
Ligand
BDBM50043744
Substrate
Meas. Tech.
ChEMBL_49501 (CHEMBL662796)
IC50
300±n/a nM
Citation
 Bird, JDe Mello, RCHarper, GPHunter, DJKarran, EHMarkwell, REMiles-Williams, AJRahman, SSWard, RW Synthesis of novel N-phosphonoalkyl dipeptide inhibitors of human collagenase. J Med Chem 37:158-69 (1994)  
Target
Name:
Interstitial collagenase
Synonyms:
CLG MMP1 Matrix metalloproteinase-1 | Matrix metalloproteinase-1 (MMP-1)
Type:
Enzyme
Mol. Mass.:
54010.26
Organism:
Homo sapiens (Human)
Description:
P03956
Residue:
469
  
Inhibitor
Name:
BDBM50043744
Synonyms:
((S)-1-{(S)-1-[(S)-2-(4-Methoxy-phenyl)-1-methylcarbamoyl-ethylcarbamoyl]-3-methyl-butylamino}-propyl)-phosphonic acid | CHEMBL45010
Type:
Small organic molecule
Emp. Form.:
C20H34N3O6P
Mol. Mass.:
443.4742
SMILES:
CC[C@@H](N[C@@H](CC(C)C)C(=O)N[C@@H](Cc1ccc(OC)cc1)C(=O)NC)P(O)(O)=O
: