Target
Histamine H3 receptor
Ligand
BDBM50496276
Substrate
Meas. Tech.
ChEMBL_1296756 (CHEMBL3132259)
Ki
21±n/a nM
Citation
 Brown, DGBernstein, PRGriffin, AWesolowski, SLabrecque, DTremblay, MCSylvester, MMauger, REdwards, PDThroner, SRFolmer, JJCacciola, JScott, CLazor, LAPourashraf, MSanthakumar, VPotts, WMSydserff, SGiguère, PLévesque, CDasser, MGroblewski, T Discovery of spirofused piperazine and diazepane amides as selective histamine-3 antagonists with in vivo efficacy in a mouse model of cognition. J Med Chem 57:733-58 (2014)  
Target
Name:
Histamine H3 receptor
Synonyms:
G-protein coupled receptor 97 HH3R HRH3 Histamine H3 receptor (H3) Histamine receptor (H3 and H4)
Type:
G Protein-Coupled Receptor (GPCR)
Mol. Mass.:
48691.47
Organism:
Homo sapiens (Human)
Description:
Binding assays were using CHO cells stably expressing hH3R receptors.
Residue:
445
  
Inhibitor
Name:
BDBM50496276
Synonyms:
CHEMBL3127670
Type:
Small organic molecule
Emp. Form.:
C26H39N3O
Mol. Mass.:
409.6074
SMILES:
O=C(C1CC11CCN(CCc2ccccc2)CC1)N1CCN(CC1)C1CCCCC1
: