Target
Histamine H3 receptor
Ligand
BDBM50496284
Substrate
Meas. Tech.
ChEMBL_1296757 (CHEMBL3132260)
IC50
2.7±n/a nM
Citation
 Brown, DGBernstein, PRGriffin, AWesolowski, SLabrecque, DTremblay, MCSylvester, MMauger, REdwards, PDThroner, SRFolmer, JJCacciola, JScott, CLazor, LAPourashraf, MSanthakumar, VPotts, WMSydserff, SGiguère, PLévesque, CDasser, MGroblewski, T Discovery of spirofused piperazine and diazepane amides as selective histamine-3 antagonists with in vivo efficacy in a mouse model of cognition. J Med Chem 57:733-58 (2014)  
Target
Name:
Histamine H3 receptor
Synonyms:
G-protein coupled receptor 97 HH3R HRH3 Histamine H3 receptor (H3) Histamine receptor (H3 and H4)
Type:
G Protein-Coupled Receptor (GPCR)
Mol. Mass.:
48691.47
Organism:
Homo sapiens (Human)
Description:
Binding assays were using CHO cells stably expressing hH3R receptors.
Residue:
445
  
Inhibitor
Name:
BDBM50496284
Synonyms:
CHEMBL3127691
Type:
Small organic molecule
Emp. Form.:
C24H36N4O3S
Mol. Mass.:
460.633
SMILES:
O=C(N1CCC2(C1)CCN(CC2)S(=O)(=O)c1ccccc1)N1CCCN(CC1)C1CCC1
: