Target
5-hydroxytryptamine receptor 1A
Ligand
BDBM50011247
Substrate
Meas. Tech.
ChEBML_1203
Ki
8.4±n/a nM
Citation
 Stjernlöf, PGullme, MElebring, TAndersson, BWikström, HLagerquist, SSvensson, KEkman, ACarlsson, ASundell, S (S)- and (R)-8-(di-n-propylamino)-6,7,8,9-tetrahydro-3H-benz[e]indole-1- carbaldehyde: a new class of orally active 5-HT1A-receptor agonists. J Med Chem 36:2059-65 (1993)  
Target
Name:
5-hydroxytryptamine receptor 1A
Synonyms:
5-HT-1A 5-HT1A 5-hydroxytryptamine receptor 1A (5HT1A) 5ht1a Htr1a Serotonin 1a (5-HT1a) receptor/Adrenergic receptor alpha-1 | Serotonin receptor 1A
Type:
G Protein-Coupled Receptor (GPCR)
Mol. Mass.:
46445.29
Organism:
Rattus norvegicus (rat)
Description:
Binding assays were performed using rat hippocampal membranes.
Residue:
422
  
Inhibitor
Name:
BDBM50011247
Synonyms:
7-Dipropylamino-5,6,7,8-tetrahydro-naphthalen-1-ol; hydrobromide CHEMBL541621 | S-(-)-7-Dipropylamino-5,6,7,8-tetrahydro-naphthalen-1-ol
Type:
Small organic molecule
Emp. Form.:
C16H25NO
Mol. Mass.:
247.3758
SMILES:
CCCN(CCC)[C@H]1CCc2cccc(O)c2C1
: