Target
Dihydrofolate reductase
Ligand
BDBM50016460
Substrate
Meas. Tech.
ChEBML_54602
Ki
0.005±n/a nM
Citation
 DeGraw, JIColwell, WTPiper, JRSirotnak, FM Synthesis and antitumor activity of 10-propargyl-10-deazaaminopterin. J Med Chem 36:2228-31 (1993)  
Target
Name:
Dihydrofolate reductase
Synonyms:
DYR_MOUSE | Dhfr
Type:
Enzyme
Mol. Mass.:
21608.82
Organism:
Mus musculus (Mouse)
Description:
Residue:
187
  
Inhibitor
Name:
BDBM50016460
Synonyms:
(S)-2-{4-[1-(2,4-Diamino-pteridin-6-ylmethyl)-propyl]-benzoylamino}-pentanedioic acid Edatrexate TCMDC-137768
Type:
Small organic molecule
Emp. Form.:
C22H25N7O5
Mol. Mass.:
467.4778
SMILES:
CCC(Cc1cnc2nc(N)nc(N)c2n1)c1ccc(cc1)C(=O)N[C@@H](CCC(O)=O)C(O)=O
: