Target
Glycylpeptide N-tetradecanoyltransferase
Ligand
BDBM50496903
Substrate
Meas. Tech.
ChEMBL_1336013 (CHEMBL3238987)
Ki
152±n/a nM
Citation
 Rackham, MDBrannigan, JARangachari, KMeister, SWilkinson, AJHolder, AALeatherbarrow, RJTate, EW Design and synthesis of high affinity inhibitors of Plasmodium falciparum and Plasmodium vivax N-myristoyltransferases directed by ligand efficiency dependent lipophilicity (LELP). J Med Chem 57:2773-88 (2014)  
Target
Name:
Glycylpeptide N-tetradecanoyltransferase
Synonyms:
Myristoyl-CoA:protein N-myristoyltransferase NMT_PLAF7 | Peptide N-myristoyltransferase
Type:
PROTEIN
Mol. Mass.:
47977.09
Organism:
Plasmodium falciparum (isolate 3D7)
Description:
ChEMBL_862035
Residue:
410
  
Inhibitor
Name:
BDBM50496903
Synonyms:
CHEMBL3237430
Type:
Small organic molecule
Emp. Form.:
C24H25N3O2S
Mol. Mass.:
419.539
SMILES:
CC(C)(c1nnc(o1)-c1sc2ccccc2c1OC1CCNCC1)c1ccccc1
: