Target
Neprilysin
Ligand
BDBM50044866
Substrate
Meas. Tech.
ChEMBL_144621 (CHEMBL752833)
Ki
0.080000±n/a nM
Citation
 Flynn, GABeight, DWMehdi, SKoehl, JRGiroux, ELFrench, JFHake, PWDage, RC Application of a conformationally restricted Phe-Leu dipeptide mimetic to the design of a combined inhibitor of angiotensin I-converting enzyme and neutral endopeptidase 24.11. J Med Chem 36:2420-3 (1993)  
Target
Name:
Neprilysin
Synonyms:
Mme Neprilysin Neutral endopeptidase 24.11
Type:
Protein
Mol. Mass.:
85789.59
Organism:
Rattus norvegicus (Rat)
Description:
P07861
Residue:
750
  
Inhibitor
Name:
BDBM50044866
Synonyms:
7-(2-Mercapto-3-phenyl-propionylamino)-6-oxo-1,2,3,4,6,7,8,12b-octahydro-benzo[c]pyrido[1,2-a]azepine-4-carboxylic acid MDL-100173
Type:
Small organic molecule
Emp. Form.:
C24H26N2O4S
Mol. Mass.:
438.539
SMILES:
OC(=O)[C@H]1CCCC2N1C(=O)C(Cc1ccccc21)NC(=O)C(S)Cc1ccccc1
: