Target
Retinoic acid receptor beta
Ligand
BDBM50045267
Substrate
Meas. Tech.
ChEBML_195796
EC50
5±n/a nM
Citation
 Jong, LLehmann, JMHobbs, PDHarlev, EHuffman, JCPfahl, MDawson, MI Conformational effects on retinoid receptor selectivity. 1. Effect of 9-double bond geometry on retinoid X receptor activity. J Med Chem 36:2605-13 (1993)  
Target
Name:
Retinoic acid receptor beta
Synonyms:
HAP NR1B2 RAR-beta RARB Retinoic acid receptor RXR-alpha/Retinoic acid receptor beta Retinoid receptor
Type:
PROTEIN
Mol. Mass.:
50498.70
Organism:
Homo sapiens (Human)
Description:
ChEMBL_1458015
Residue:
455
  
Inhibitor
Name:
BDBM50045267
Synonyms:
4-[2-Methyl-4-(2,6,6-trimethyl-cyclohex-1-enyl)-buta-1,3-dienyl]-benzoic acid | CHEMBL284264
Type:
Small organic molecule
Emp. Form.:
C21H26O2
Mol. Mass.:
310.4299
SMILES:
C\C(\C=C\C1=C(C)CCCC1(C)C)=C/c1ccc(cc1)C(O)=O
: