Target
Polyunsaturated fatty acid 5-lipoxygenase
Ligand
BDBM50045670
Substrate
Meas. Tech.
ChEBML_4181
IC50
350±n/a nM
Citation
 Hutchinson, JHRiendeau, DBrideau, CChan, CDelorme, DDenis, DFalgueyret, JPFortin, RGuay, JHamel, P Substituted thiopyrano[2,3,4-c,d]indoles as potent, selective, and orally active inhibitors of 5-lipoxygenase. Synthesis and biological evaluation of L-691,816. J Med Chem 36:2771-87 (1993)  
Target
Name:
Polyunsaturated fatty acid 5-lipoxygenase
Synonyms:
Alox5 LOX5_RAT
Type:
PROTEIN
Mol. Mass.:
78082.31
Organism:
Rattus norvegicus
Description:
ChEMBL_1432947
Residue:
673
  
Inhibitor
Name:
BDBM50045670
Synonyms:
3-[1-(4-Chloro-benzyl)-6-(5-cyano-pyridin-2-ylmethoxy)-4-methyl-4,5-dihydro-1H-3-thia-1-aza-acenaphthylen-2-yl]-2,2-dimethyl-propionic acid | CHEMBL327889
Type:
Small organic molecule
Emp. Form.:
C30H28ClN3O3S
Mol. Mass.:
546.08
SMILES:
CC1Cc2c(OCc3ccc(cn3)C#N)ccc3n(Cc4ccc(Cl)cc4)c(CC(C)(C)C(O)=O)c(S1)c23
: