Target
Renin
Ligand
BDBM50045693
Substrate
Meas. Tech.
ChEMBL_195976 (CHEMBL807682)
IC50
0.370000±n/a nM
Citation
 Heitsch, HHenning, RKleemann, HWLinz, WNickel, WURuppert, DUrbach, HWagner, A Renin inhibitors containing a pyridyl amino diol derived C-terminus. J Med Chem 36:2788-800 (1993)  
Target
Name:
Renin
Synonyms:
Angiotensinogenase RENI_HUMAN
Type:
Enzyme
Mol. Mass.:
45058.99
Organism:
Homo sapiens (Human)
Description:
Residue:
406
  
Inhibitor
Name:
BDBM50045693
Synonyms:
4-Amino-piperidine-1-carboxylic acid 1-[1-(1-cyclohexylmethyl-2,3-dihydroxy-5-pyridin-2-yl-pentylcarbamoyl)-2-(1H-imidazol-4-yl)-ethylcarbamoyl]-2-phenyl-ethyl ester | CHEMBL94731
Type:
Small organic molecule
Emp. Form.:
C38H53N7O6
Mol. Mass.:
703.8707
SMILES:
NC1CCN(CC1)C(=O)O[C@@H](Cc1ccccc1)C(=O)N[C@@H](Cc1cnc[nH]1)C(=O)N[C@@H](CC1CCCCC1)[C@@H](O)[C@@H](O)CCc1ccccn1
: