Target
Platelet-activating factor receptor
Ligand
BDBM50046003
Substrate
Meas. Tech.
ChEMBL_151692 (CHEMBL760442)
IC50
20±n/a nM
Citation
 Carceller, EMerlos, MGiral, MAlmansa, CBartrolí, JGarcía-Rafanell, JForn, J Synthesis and structure-activity relationships of 1-acyl-4-((2-methyl-3-pyridyl)cyanomethyl)piperazines as PAF antagonists. J Med Chem 36:2984-97 (1993)  
Target
Name:
Platelet-activating factor receptor
Synonyms:
PAF-R PTAFR_CAVPO Platelet-activating factor receptor
Type:
Protein
Mol. Mass.:
39005.63
Organism:
Cavia porcellus
Description:
Residue:
342
  
Inhibitor
Name:
BDBM50046003
Synonyms:
(3-{4-[Cyano-(2-methyl-pyridin-3-yl)-methyl]-piperazin-1-yl}-3-oxo-1-phenyl-propyl)-methyl-carbamic acid methyl ester | CHEMBL100340
Type:
Small organic molecule
Emp. Form.:
C24H29N5O3
Mol. Mass.:
435.5188
SMILES:
COC(=O)N(C)C(CC(=O)N1CCN(CC1)C(C#N)c1cccnc1C)c1ccccc1
: